{"text_format":"1","workbook":"xlsx","n_sheets":11,"sheets":["Annexe II","Annexe III","Annexe IV","Superficie","Calcul env. achat-construction","Mobilier","Budget d'implantation","Budget modifié","Budget coûts réels","Budget final","Menu déroulant"],"not_rendered":{"charts":0,"images":2,"macros":0,"external_links":0,"defined_names":9,"comments":6,"pivot_tables":0},"unopened":[],"bounds":{"document_bytes":16777216,"sheet_cells":100000,"rows_first":2000,"rows_last":500,"rows_between":2000,"halvings":0,"cell_chars":16384,"cell_head_chars":4096},"cells_cut":0,"cells_raw":0,"read":"whole","date_system":"1900"}

{"sheet":"Annexe II","index":0,"n_rows":103,"n_cols":2,"rows_kept":103,"cut":false,"hidden":true,"merged":[[0,0,0,1],[1,0,1,1]]}
["Annexe II"]
["Montants de référence maximaux – Installation"]
["NOMBRE DE PLACES SUBVENTIONNÉES","MONTANT MAXIMAL ACHAT-CONSTRUCTION "]
[1,667924]
[2,667924]
[3,667924]
[4,667924]
[5,667924]
[6,667924]
[7,667924]
[8,667924]
[9,667924]
[10,667924]
[11,667924]
[12,667924]
[13,667924]
[14,667924]
[15,667924]
[16,667924]
[17,667924]
[18,667924]
[19,667924]
[20,689973]
[21,712027]
[22,734077]
[23,756131]
[24,778189]
[25,800235]
[26,822290]
[27,844342]
[28,866395]
[29,888453]
[30,910501]
[31,932554]
[32,954606]
[33,976657]
[34,998716]
[35,1020772]
[36,1042821]
[37,1064876]
{"$rows_left_out":64}
{"sheet":"Annexe III","index":1,"n_rows":103,"n_cols":2,"rows_kept":103,"cut":false,"hidden":true,"merged":[[0,0,0,1],[1,0,1,1]]}
["Annexe III"]
["Montants de référence maximaux – Salle multifonctionnelle"]
["NOMBRE DE PLACES SUBVENTIONNEES","MONTANT MAXIMAL POUR UNE SALLE MULTIFONCTIONNELLE"]
[1,95362]
[2,95362]
[3,95362]
[4,95362]
[5,95362]
[6,95362]
[7,95362]
[8,95362]
[9,95362]
[10,95362]
[11,95362]
[12,95362]
[13,95362]
[14,95362]
[15,95362]
[16,95362]
[17,95362]
[18,95362]
[19,95362]
[20,127143]
[21,127143]
[22,127143]
[23,127143]
[24,127143]
[25,127143]
[26,127143]
[27,127143]
[28,127143]
[29,127143]
[30,127143]
[31,127143]
[32,127143]
[33,127143]
[34,127143]
[35,127143]
[36,127143]
[37,127143]
{"$rows_left_out":64}
{"sheet":"Annexe IV","index":2,"n_rows":27,"n_cols":2,"rows_kept":27,"cut":false,"hidden":true,"merged":[]}
["Annexe IV"]
["Indices régionaux de modulation"]
["Région administrative"," INDICE"]
["Abitibi-Témiscamingue",1.1499999999999999]
["Bas-Saint-Laurent",1.05]
["Capitale-Nationale",1]
["Centre-du-Québec",1]
["Chaudière-Appalaches",1]
["Côte-Nord - Est de Pointe-Parent et Schefferville",2]
["Côte-Nord - Rivière Moisie à Pointe-Parent et Fermont ",1.6]
["Côte-Nord - Rivière Saguenay à rivière Moisie ",1.25]
["Estrie",1]
["Gaspésie ",1.1000000000000001]
["Gaspésie - Îles-de-la-Madeleine",1.6]
["Lanaudière",1]
["Laurentides - MRC d’Antoine-Labelle",1.1200000000000001]
["Laurentides - Sauf la MRC d’Antoine-Labelle",1]
["Laval",1]
["Mauricie - Région de La Tuque",1.05]
["Mauricie - Sauf la région de La Tuque",1]
["Montérégie",1]
["Montréal",1]
["Nord-du-Québec - Région de Chibougamau",1.25]
["Nord-du-Québec - Région du Nunavik",4]
["Nord-du-Québec - Sauf les régions de Chibougamau et du Nunavik",1.6]
["Outaouais",1.1200000000000001]
["Saguenay–Lac-Saint-Jean",1.05]

{"sheet":"Superficie","index":3,"n_rows":103,"n_cols":4,"rows_kept":103,"cut":false,"hidden":true,"merged":[[0,0,0,3]]}
["Estimation superficie"]
["Nombre de places en installation    (0-59 mois)","Superficie pieds2","Superficies Salle Multi pieds2","Superficie pieds2 0-18 mois"]
[0,0,0,0]
[1,{"$f":"'Annexe II'!B4/318","v":2100.3899371069183},{"$f":"'Annexe III'!B4/318","v":299.88050314465409},{"$f":"A4*25.84","v":25.84}]
[2,{"$f":"'Annexe II'!B5/318","v":2100.3899371069183},{"$f":"'Annexe III'!B5/318","v":299.88050314465409},{"$f":"A5*25.84","v":51.68}]
[3,{"$f":"'Annexe II'!B6/318","v":2100.3899371069183},{"$f":"'Annexe III'!B6/318","v":299.88050314465409},77.52]
[4,{"$f":"'Annexe II'!B7/318","v":2100.3899371069183},{"$f":"'Annexe III'!B7/318","v":299.88050314465409},103.36]
[5,{"$f":"'Annexe II'!B8/318","v":2100.3899371069183},{"$f":"'Annexe III'!B8/318","v":299.88050314465409},129.19999999999999]
[6,{"$f":"'Annexe II'!B9/318","v":2100.3899371069183},{"$f":"'Annexe III'!B9/318","v":299.88050314465409},155.04]
[7,{"$f":"'Annexe II'!B10/318","v":2100.3899371069183},{"$f":"'Annexe III'!B10/318","v":299.88050314465409},180.88]
[8,{"$f":"'Annexe II'!B11/318","v":2100.3899371069183},{"$f":"'Annexe III'!B11/318","v":299.88050314465409},206.72]
[9,{"$f":"'Annexe II'!B12/318","v":2100.3899371069183},{"$f":"'Annexe III'!B12/318","v":299.88050314465409},232.56]
[10,{"$f":"'Annexe II'!B13/318","v":2100.3899371069183},{"$f":"'Annexe III'!B13/318","v":299.88050314465409},258.39999999999998]
[11,{"$f":"'Annexe II'!B14/318","v":2100.3899371069183},{"$f":"'Annexe III'!B14/318","v":299.88050314465409},284.24]
[12,{"$f":"'Annexe II'!B15/318","v":2100.3899371069183},{"$f":"'Annexe III'!B15/318","v":299.88050314465409},310.08]
[13,{"$f":"'Annexe II'!B16/318","v":2100.3899371069183},{"$f":"'Annexe III'!B16/318","v":299.88050314465409},335.92]
[14,{"$f":"'Annexe II'!B17/318","v":2100.3899371069183},{"$f":"'Annexe III'!B17/318","v":299.88050314465409},361.76]
[15,{"$f":"'Annexe II'!B18/318","v":2100.3899371069183},{"$f":"'Annexe III'!B18/318","v":299.88050314465409},387.6]
[16,{"$f":"'Annexe II'!B19/318","v":2100.3899371069183},{"$f":"'Annexe III'!B19/318","v":299.88050314465409},413.44]
[17,{"$f":"'Annexe II'!B20/318","v":2100.3899371069183},{"$f":"'Annexe III'!B20/318","v":299.88050314465409},439.28]
[18,{"$f":"'Annexe II'!B21/318","v":2100.3899371069183},{"$f":"'Annexe III'!B21/318","v":299.88050314465409},465.12]
[19,{"$f":"'Annexe II'!B22/318","v":2100.3899371069183},{"$f":"'Annexe III'!B22/318","v":299.88050314465409},490.96]
[20,{"$f":"'Annexe II'!B23/318","v":2169.7264150943397},{"$f":"'Annexe III'!B23/318","v":399.82075471698113},516.79999999999995]
[21,{"$f":"'Annexe II'!B24/318","v":2239.0786163522012},{"$f":"'Annexe III'!B24/318","v":399.82075471698113},542.64]
[22,{"$f":"'Annexe II'!B25/318","v":2308.4182389937105},{"$f":"'Annexe III'!B25/318","v":399.82075471698113},568.48]
[23,{"$f":"'Annexe II'!B26/318","v":2377.7704402515724},{"$f":"'Annexe III'!B26/318","v":399.82075471698113},594.32000000000005]
[24,{"$f":"'Annexe II'!B27/318","v":2447.135220125786},{"$f":"'Annexe III'!B27/318","v":399.82075471698113},620.16]
[25,{"$f":"'Annexe II'!B28/318","v":2516.4622641509436},{"$f":"'Annexe III'!B28/318","v":399.82075471698113},646]
[26,{"$f":"'Annexe II'!B29/318","v":2585.817610062893},{"$f":"'Annexe III'!B29/318","v":399.82075471698113},671.84]
[27,{"$f":"'Annexe II'!B30/318","v":2655.1635220125786},{"$f":"'Annexe III'!B30/318","v":399.82075471698113},697.68]
[28,{"$f":"'Annexe II'!B31/318","v":2724.5125786163521},{"$f":"'Annexe III'!B31/318","v":399.82075471698113},723.52]
[29,{"$f":"'Annexe II'!B32/318","v":2793.8773584905662},{"$f":"'Annexe III'!B32/318","v":399.82075471698113},749.36]
[30,{"$f":"'Annexe II'!B33/318","v":2863.2106918238992},{"$f":"'Annexe III'!B33/318","v":399.82075471698113},775.2]
[31,{"$f":"'Annexe II'!B34/318","v":2932.5597484276727},{"$f":"'Annexe III'!B34/318","v":399.82075471698113},801.04]
[32,{"$f":"'Annexe II'!B35/318","v":3001.9056603773583},{"$f":"'Annexe III'!B35/318","v":399.82075471698113},826.88]
[33,{"$f":"'Annexe II'!B36/318","v":3071.248427672956},{"$f":"'Annexe III'!B36/318","v":399.82075471698113},852.72]
[34,{"$f":"'Annexe II'!B37/318","v":3140.616352201258},{"$f":"'Annexe III'!B37/318","v":399.82075471698113},878.56]
[35,{"$f":"'Annexe II'!B38/318","v":3209.9748427672957},{"$f":"'Annexe III'!B38/318","v":399.82075471698113},904.4]
[36,{"$f":"'Annexe II'!B39/318","v":3279.3113207547171},{"$f":"'Annexe III'!B39/318","v":399.82075471698113},930.24]
[37,{"$f":"'Annexe II'!B40/318","v":3348.6666666666665},{"$f":"'Annexe III'!B40/318","v":399.82075471698113},956.08]
{"$rows_left_out":64}
{"sheet":"Calcul env. achat-construction","index":4,"n_rows":42,"n_cols":2,"rows_kept":42,"cut":false,"hidden":false,"merged":[[1,0,1,1],[2,0,2,1]]}
["Financement achat construction - acquisition"]
["Insérer dans l'espace en vert votre nombre de places totales, votre nombre de places poupons ainsi que votre région et le calcul se fera automatiquement."]
["Exemple fait pour un CPE de 80 places, dont 15 poupons, comprenant une salle multifonctionnelle, situé dans le Bas-Saint-Laurent"]
[]
["Nombre de places totales",52]
["Nombre de place 18 mois ou moins (poupons)",10]
["Région","Montréal"]
["Salle multifonctionnelle","oui"]
["Montant de base",{"$f":"VLOOKUP('Calcul env. achat-construction'!B5,'Annexe II'!A4:B103,2,FALSE)","v":1417502}]
["Montant poupon",{"$f":"B6*8219","v":82190}]
["Salle multifonctionnelle",{"$f":"VLOOKUP(B5,'Annexe III'!A4:B103,2,FALSE)","v":158935}]
["Sous-total avant indice régional de modulation ",{"$f":"IF(B8=\"oui\",B9+B10+B11,B9+B10)","v":1658627}]
[]
["Indice régional de modulation",{"$f":"VLOOKUP(B7,'Annexe IV'!A4:B27,2,FALSE)","v":1}]
[]
["Enveloppe maximale achat construction",{"$f":"B12*B14","v":1658627}]
[]
["Enveloppe aménagement extérieur",{"$f":"0.07*B16","v":116103.89000000001}]
[]
["Enveloppe honoraires professionnels",{"$f":"_xlfn.IFS((B16+B18)<300000,(B16+B18)*0.09,(B16+B18)<600000,27000+(((B16+B18)-300000)*0.072),(B16+B18)<1250000,48600+(((B16+B18)-600000)*0.063),(B16+B18)>1250000,89550+(((B16+B18)-1250000)*0.0576))","v":119774.49926400001}]
[]
["Enveloppe chargé projet",{"$f":"_xlfn.IFS((B16+B18)<750000,(B16+B18)*0.03,(B16+B18)<1500000,22500+(((B16+B18)-750000)*0.02),(B16+B18)>1500000,37500+(((B16+B18)-1500000)*0.015))","v":41620.963350000005}]
[]
["Enveloppe mobilier-équipement",{"$f":"_xlfn.IFS(B5<41,(B5*918)+27588+(B6*918),B5>40,(B5*918)+55179+(B6*918))","v":112095}]
[]
["Enveloppe jeux extérieurs",{"$f":"B5*735","v":38220}]
[]
["Enveloppe intégration des Arts à l'architecture","Si projet égal ou supérieur à 150 000$"]
[]
["Enveloppe achat de terrain","Selon opportunités"]
[]
["Enveloppe spécifique exceptionnelle","Exigences peu communes émanant d'autorités compétentes, telle une municipalité"]
[]
["Enveloppe totale préliminaire",{"$f":"B16+B18+B20+B22+B24+B26","v":2086441.3526140002}]
[]
["Superficie pi2 AVEC salle multi",{"$f":"SUM(VLOOKUP('Calcul env. achat-construction'!B5,Superficie!A3:D103,2,FALSE),VLOOKUP('Calcul env. achat-construction'!B6,Superficie!A3:D103,4,FALSE),VLOOKUP('Calcul env. achat-construction'!B5,Superficie!A3:D103,3,FALSE))","v":5215.7490566037732}]
[]
["Superficie pi2 SANS salle multi",{"$f":"SUM(VLOOKUP('Calcul env. achat-construction'!B5,Superficie!A3:D103,2,FALSE),VLOOKUP('Calcul env. achat-construction'!B6,Superficie!A3:D103,4,FALSE))","v":4715.9534591194961}]
[]
["Superficie minimum aire de jeu extérieur pi2 ",{"$f":"0.333*(43.0556*B5)","v":745.55076960000008}]
{"$rows_left_out":3}
{"sheet":"Mobilier","index":5,"n_rows":32,"n_cols":9,"rows_kept":32,"cut":false,"hidden":true,"merged":[]}
[]
["Mobiliers","Qn","Coût","Total",null,"Aménagement extérieur","Qn enfants",null,"Total"]
["Lit poupon",{"$f":"'Calcul env. achat-construction'!B6","v":10},550,{"$f":"B3*C3","v":5500},null,"Sationnement",{"$f":"'Calcul env. achat-construction'!B5","v":52},1225,{"$f":"G3*H3","v":63700}]
["Chaises hautes",{"$f":"'Calcul env. achat-construction'!B6","v":10},350,{"$f":"B4*C4","v":3500},null,"Aménagement paysager",{"$f":"'Calcul env. achat-construction'!B5","v":52},155,{"$f":"G4*H4","v":8060}]
["Tables",{"$f":"('Calcul env. achat-construction'!B5-'Calcul env. achat-construction'!B6)/4","v":10.5},350,{"$f":"B5*C5","v":3675},null,"Gazon ",{"$f":"'Calcul env. achat-construction'!B5","v":52},250,13000]
["Chaises",{"$f":"'Calcul env. achat-construction'!B5-'Calcul env. achat-construction'!B6","v":42},150,{"$f":"B6*C6","v":6300},null,"Clôture",{"$f":"'Calcul env. achat-construction'!B5","v":52},300,15600]
["Tables perso et chaises",1,1500,{"$f":"B7*C7","v":1500},null,"TOTAL AMÉNAGEMENT EXTÉRIEUR",null,{"$f":"SUM(H3:H6)","v":1930},{"$f":"SUM(I3:I6)","v":100360}]
["TOTAL ÉQUIPEMENT MEUBLE",null,null,{"$f":"SUM(D3:D7)","v":20475}]
[]
["Buanderie"]
["Laveuse",1,1500,{"$f":"C11*B11","v":1500}]
["Sécheuse",1,1500,{"$f":"C12*B12","v":1500}]
["Cuisine"]
["Hotte",1,5000,{"$f":"B14*C14","v":5000}]
["Frigo",1,6000,{"$f":"B15*C15","v":6000}]
["Congélo",1,6000,{"$f":"B16*C16","v":6000}]
["Cuisinière",1,5000,{"$f":"B17*C17","v":5000}]
["Lave-vaisselle",1,5000,{"$f":"B18*C18","v":5000}]
["TOTAL CUISINE BUANDERIE",null,null,{"$f":"SUM(D10:D18)","v":30000}]
[]
["Bureaux et chaises",1,1250,{"$f":"C21*B21","v":1250}]
["TOTAL ÉQUIPEMENT BUREAU",null,null,{"$f":"SUM(D21:D21)","v":1250}]
[]
["Ordinateur",1,1250,{"$f":"C24*B24","v":1250}]
["Imprimante",1,1250,{"$f":"C25*B25","v":1250}]
["TOTAL MATÉRIEL INFORMATIQUE",null,null,{"$f":"SUM(D24:D25)","v":2500}]
[]
["Matériel éducatif",{"$f":"'Calcul env. achat-construction'!B5","v":52},425,{"$f":"C28*B28","v":22100}]
["TOTAL MATÉRIEL ÉDUCATIF",null,null,{"$f":"SUM(D28:D28)","v":22100}]
[]
["Jouets",{"$f":"'Calcul env. achat-construction'!B5","v":52},400,{"$f":"C31*B31","v":20800}]
["TOTAL JOUETS",null,null,{"$f":"D31","v":20800}]

{"sheet":"Budget d'implantation","index":6,"n_rows":235,"n_cols":9,"rows_kept":235,"cut":false,"hidden":true,"merged":[[91,3,91,6],[192,3,192,6],[223,6,223,7],[1,5,1,6],[1,7,1,8],[2,7,2,8],[4,2,4,7],[8,2,8,3],[9,2,9,3]]}
[]
[null,null,null,null,null,"Date de préparation:"]
[null,null,null,null,null,null,"Préparé par:"]
[]
[null,null,"BUDGET D'IMPLANTATION PFI"]
[]
["Type de projet:",null,"Achat terrain pour installation d'un préfabriqué",null,null,null,null,"R/B:"]
["Nom du CPE :"]
["No de division :",null,null,null,null,null,"Nombre de places 0-17 mois :",null,{"$f":"'Calcul env. achat-construction'!B6","v":10}]
["No d'installation :",null,null,null,null,null,"Nombre de places 18-59 mois :",null,{"$f":"'Calcul env. achat-construction'!B5-'Calcul env. achat-construction'!B6","v":42}]
["Dimension installation (en m2):",null,null,null,null,null,"Date d'ouverture :"]
["Dimension salle multi (en m2):"]
[]
[]
[null,null,null,null,null,"Coûts                      avant taxes","Taxes (100%) 1","Total                          + 100 % des taxes","Coûts                              + 50% des taxes"]
[]
[null,null,null,null,null,null,"TPS",0.05]
[null,null,null,null,null,null,"TVQ",9.9750000000000005E-2]
[]
["Achat - construction"]
[null,null,"Enveloppe Achat-Construction",null,null,null,null,null,{"$f":"'Calcul env. achat-construction'!B16","v":1658627}]
[null,"Plus:","Enveloppe Spécifique Exceptionelle, si applicable"]
[null,"+ ou -","Transfert d'enveloppe (provenant ou vers)"]
[null,"Moins:","Mise de fonds, si applicable"]
[null,null,"Totale de l'enveloppe maximum admissible (A)",null,null,null,null,null,{"$f":"SUM(I21:I24)","v":1658627}]
[]
[null,null,"Coûts de construction budgétés (B)",null,null,null,null,null,{"$f":"I43","v":0}]
[]
[null,null,"Enveloppe reconnue Achat-Construction (minimum entre A et B)",null,null,null,null,null,{"$f":"MIN(I25,I27)","v":0}]
[]
[]
[null,"Coût de construction ou d'agrandissement",null,null,null,null,{"$f":"(F32*TPS)+(F32*TVQ)","v":0},{"$f":"(F32+G32)","v":0},{"$f":"ROUND(F32+(G32/2),2)","v":0}]
[null,"Branchement temporaire aux services publics",null,null,null,null,0,{"$f":"(F33+G33)","v":0},{"$f":"ROUND(F33+(G33/2),2)","v":0}]
[null,"Aménagement de voies de circulation temporaire",null,null,null,null,0,0,0]
[null,"Permis de construction",null,null,null,null,0,0,0]
[null,"Assurances exigées pour les travaux",null,null,null,null,0,0,0]
[null,"Achat d'un bâtiment",null,null,null,null,0,0,0]
[null,"Amélioration locative",null,null,null,null,0,0,0]
[null,"Rénovation ou réaménagement",null,null,null,null,0,0,0]
[null,"Autres (préciser) :",null,null,null,null,0,0,0]
{"$rows_left_out":196}
{"sheet":"Budget modifié","index":7,"n_rows":235,"n_cols":9,"rows_kept":235,"cut":false,"hidden":true,"merged":[[91,3,91,6],[192,3,192,6],[223,6,223,7],[1,5,1,6],[1,7,1,8],[2,7,2,8],[4,2,4,7],[8,2,8,3],[9,2,9,3]]}
[]
[null,null,null,null,null,"Date de préparation:"]
[null,null,null,null,null,null,"Préparé par:"]
[]
[null,null,"BUDGET D'IMPLANTATION PFI"]
[]
["Type de projet:",null,null,null,null,null,null,"R/B:"]
["Nom du CPE :"]
["No de division :",null,null,null,null,null,"Nombre de places 0-17 mois :",null,{"$f":"'Calcul env. achat-construction'!B6","v":10}]
["No d'installation :",null,null,null,null,null,"Nombre de places 18-59 mois :",null,{"$f":"'Calcul env. achat-construction'!B5-'Calcul env. achat-construction'!B6","v":42}]
["Dimension installation (en m2):",null,null,null,null,null,"Date d'ouverture :"]
["Dimension salle multi (en m2):"]
[]
[]
[null,null,null,null,null,"Coûts                      avant taxes","Taxes (100%) 1","Total                          + 100 % des taxes","Coûts                              + 50% des taxes"]
[]
[null,null,null,null,null,null,"TPS",0.05]
[null,null,null,null,null,null,"TVQ",9.9750000000000005E-2]
[]
["Achat - construction"]
[null,null,"Enveloppe Achat-Construction",null,null,null,null,null,{"$f":"'Calcul env. achat-construction'!B16","v":1658627}]
[null,"Plus:","Enveloppe Spécifique Exceptionelle, si applicable"]
[null,"+ ou -","Transfert d'enveloppe (provenant ou vers)"]
[null,"Moins:","Mise de fonds, si applicable"]
[null,null,"Totale de l'enveloppe maximum admissible (A)",null,null,null,null,null,{"$f":"SUM(I21:I24)","v":1658627}]
[]
[null,null,"Coûts de construction budgétés (B)",null,null,null,null,null,{"$f":"I43","v":0}]
[]
[null,null,"Enveloppe reconnue Achat-Construction (minimum entre A et B)",null,null,null,null,null,{"$f":"MIN(I25,I27)","v":0}]
[]
[]
[null,"Coût de construction ou d'agrandissement",null,null,null,null,{"$f":"(F32*TPS)+(F32*TVQ)","v":0},{"$f":"(F32+G32)","v":0},{"$f":"ROUND(F32+(G32/2),2)","v":0}]
[null,"Branchement temporaire aux services publics",null,null,null,null,0,{"$f":"(F33+G33)","v":0},{"$f":"ROUND(F33+(G33/2),2)","v":0}]
[null,"Aménagement de voies de circulation temporaire",null,null,null,null,0,0,0]
[null,"Permis de construction",null,null,null,null,0,0,0]
[null,"Assurances exigées pour les travaux",null,null,null,null,0,0,0]
[null,"Achat d'un bâtiment",null,null,null,null,0,0,0]
[null,"Amélioration locative",null,null,null,null,0,0,0]
[null,"Rénovation ou réaménagement",null,null,null,null,0,0,0]
[null,"Autres (préciser) :",null,null,null,null,0,0,0]
{"$rows_left_out":196}
{"sheet":"Budget coûts réels","index":8,"n_rows":235,"n_cols":9,"rows_kept":235,"cut":false,"hidden":true,"merged":[[91,3,91,6],[192,3,192,6],[223,6,223,7],[1,5,1,6],[1,7,1,8],[2,7,2,8],[4,2,4,7],[8,2,8,3],[9,2,9,3]]}
[]
[null,null,null,null,null,"Date de préparation:"]
[null,null,null,null,null,null,"Préparé par:"]
[]
[null,null,"BUDGET D'IMPLANTATION PFI"]
[]
["Type de projet:",null,null,null,null,null,null,"R/B:"]
["Nom du CPE :"]
["No de division :",null,null,null,null,null,"Nombre de places 0-17 mois :",null,{"$f":"'Calcul env. achat-construction'!B6","v":10}]
["No d'installation :",null,null,null,null,null,"Nombre de places 18-59 mois :",null,{"$f":"'Calcul env. achat-construction'!B5-'Calcul env. achat-construction'!B6","v":42}]
["Dimension installation (en m2):",null,null,null,null,null,"Date d'ouverture :"]
["Dimension salle multi (en m2):"]
[]
[]
[null,null,null,null,null,"Coûts                      avant taxes","Taxes (100%) 1","Total                          + 100 % des taxes","Coûts                              + 50% des taxes"]
[]
[null,null,null,null,null,null,"TPS",0.05]
[null,null,null,null,null,null,"TVQ",9.9750000000000005E-2]
[]
["Achat - construction"]
[null,null,"Enveloppe Achat-Construction",null,null,null,null,null,{"$f":"'Calcul env. achat-construction'!B16","v":1658627}]
[null,"Plus:","Enveloppe Spécifique Exceptionelle, si applicable"]
[null,"+ ou -","Transfert d'enveloppe (provenant ou vers)"]
[null,"Moins:","Mise de fonds, si applicable"]
[null,null,"Totale de l'enveloppe maximum admissible (A)",null,null,null,null,null,{"$f":"SUM(I21:I24)","v":1658627}]
[]
[null,null,"Coûts de construction budgétés (B)",null,null,null,null,null,{"$f":"I43","v":0}]
[]
[null,null,"Enveloppe reconnue Achat-Construction (minimum entre A et B)",null,null,null,null,null,{"$f":"MIN(I25,I27)","v":0}]
[]
[]
[null,"Coût de construction ou d'agrandissement",null,null,null,null,{"$f":"(F32*TPS)+(F32*TVQ)","v":0},{"$f":"(F32+G32)","v":0},{"$f":"ROUND(F32+(G32/2),2)","v":0}]
[null,"Branchement temporaire aux services publics",null,null,null,null,0,{"$f":"(F33+G33)","v":0},{"$f":"ROUND(F33+(G33/2),2)","v":0}]
[null,"Aménagement de voies de circulation temporaire",null,null,null,null,0,0,0]
[null,"Permis de construction",null,null,null,null,0,0,0]
[null,"Assurances exigées pour les travaux",null,null,null,null,0,0,0]
[null,"Achat d'un bâtiment",null,null,null,null,0,0,0]
[null,"Amélioration locative",null,null,null,null,0,0,0]
[null,"Rénovation ou réaménagement",null,null,null,null,0,0,0]
[null,"Autres (préciser) :",null,null,null,null,0,0,0]
{"$rows_left_out":196}
{"sheet":"Budget final","index":9,"n_rows":235,"n_cols":9,"rows_kept":235,"cut":false,"hidden":true,"merged":[[91,3,91,6],[192,3,192,6],[223,6,223,7],[1,5,1,6],[1,7,1,8],[2,7,2,8],[4,2,4,7],[8,2,8,3],[9,2,9,3]]}
[]
[null,null,null,null,null,"Date de préparation:"]
[null,null,null,null,null,null,"Préparé par:"]
[]
[null,null,"BUDGET D'IMPLANTATION PFI"]
[]
["Type de projet:",null,null,null,null,null,null,"R/B:"]
["Nom du CPE :"]
["No de division :",null,null,null,null,null,"Nombre de places 0-17 mois :",null,{"$f":"'Calcul env. achat-construction'!B6","v":10}]
["No d'installation :",null,null,null,null,null,"Nombre de places 18-59 mois :",null,{"$f":"'Calcul env. achat-construction'!B5-'Calcul env. achat-construction'!B6","v":42}]
["Dimension installation (en m2):",null,null,null,null,null,"Date d'ouverture :"]
["Dimension salle multi (en m2):"]
[]
[]
[null,null,null,null,null,"Coûts                      avant taxes","Taxes (100%) 1","Total                          + 100 % des taxes","Coûts                              + 50% des taxes"]
[]
[null,null,null,null,null,null,"TPS",0.05]
[null,null,null,null,null,null,"TVQ",9.9750000000000005E-2]
[]
["Achat - construction"]
[null,null,"Enveloppe Achat-Construction",null,null,null,null,null,{"$f":"'Calcul env. achat-construction'!B16","v":1658627}]
[null,"Plus:","Enveloppe Spécifique Exceptionelle, si applicable"]
[null,"+ ou -","Transfert d'enveloppe (provenant ou vers)"]
[null,"Moins:","Mise de fonds, si applicable"]
[null,null,"Totale de l'enveloppe maximum admissible (A)",null,null,null,null,null,{"$f":"SUM(I21:I24)","v":1658627}]
[]
[null,null,"Coûts de construction budgétés (B)",null,null,null,null,null,{"$f":"I43","v":0}]
[]
[null,null,"Enveloppe reconnue Achat-Construction (minimum entre A et B)",null,null,null,null,null,{"$f":"MIN(I25,I27)","v":0}]
[]
[]
[null,"Coût de construction ou d'agrandissement",null,null,null,null,{"$f":"(F32*TPS)+(F32*TVQ)","v":0},{"$f":"(F32+G32)","v":0},{"$f":"ROUND(F32+(G32/2),2)","v":0}]
[null,"Branchement temporaire aux services publics",null,null,null,null,0,{"$f":"(F33+G33)","v":0},{"$f":"ROUND(F33+(G33/2),2)","v":0}]
[null,"Aménagement de voies de circulation temporaire",null,null,null,null,0,0,0]
[null,"Permis de construction",null,null,null,null,0,0,0]
[null,"Assurances exigées pour les travaux",null,null,null,null,0,0,0]
[null,"Achat d'un bâtiment",null,null,null,null,0,0,0]
[null,"Amélioration locative",null,null,null,null,0,0,0]
[null,"Rénovation ou réaménagement",null,null,null,null,0,0,0]
[null,"Autres (préciser) :",null,null,null,null,0,0,0]
{"$rows_left_out":196}
{"sheet":"Menu déroulant","index":10,"n_rows":2,"n_cols":1,"rows_kept":2,"cut":false,"hidden":true,"merged":[]}
["oui"]
["non"]